{"text_format":"1","workbook":"xlsx","n_sheets":7,"sheets":["Leaderboard","August","September","October","Ten Point Table","Mini Leagues","Jokers"],"not_rendered":{"charts":0,"images":8,"macros":1,"external_links":0,"defined_names":0,"comments":0,"pivot_tables":0},"unopened":[],"bounds":{"document_bytes":16777216,"sheet_cells":100000,"rows_first":2000,"rows_last":500,"rows_between":2000,"halvings":0,"cell_chars":16384,"cell_head_chars":4096},"cells_cut":0,"cells_raw":0,"read":"whole","date_system":"1900"}

{"sheet":"Leaderboard","index":0,"n_rows":65,"n_cols":14,"rows_kept":65,"cut":false,"hidden":false,"merged":[]}
[]
[]
[]
[]
["No.","Name","Team Name","2019-08-01","2019-09-01","2019-10-01","2019-11-01","2019-12-01","2020-01-01","2020-02-01","2020-03-01","2020-04-01","2020-05-01","Total Pts"]
[1,"Anastas Popov","Super Saints",{"$f":"HLOOKUP(B6,August!$I$1:$BP$87,87,FALSE)","v":173},{"$f":"HLOOKUP(B6,September!$I$1:$BP$81,81,FALSE)","v":134},{"$f":"HLOOKUP(B6,October!$I$1:$BP$57,57,FALSE)","v":25},null,null,null,null,null,null,null,{"$f":"SUM(D6:M6)","v":332}]
[2,"Eamon Fox","It's Never Over, Never Really Over",{"$f":"HLOOKUP(B7,August!$I$1:$BP$87,87,FALSE)","v":157},{"$f":"HLOOKUP(B7,September!$I$1:$BP$81,81,FALSE)","v":124},{"$f":"HLOOKUP(B7,October!$I$1:$BP$57,57,FALSE)","v":25},null,null,null,null,null,null,null,{"$f":"SUM(D7:M7)","v":306}]
[3,"Sean O'Mairtin","Creweless",{"$f":"HLOOKUP(B8,August!$I$1:$BP$87,87,FALSE)","v":161},{"$f":"HLOOKUP(B8,September!$I$1:$BP$81,81,FALSE)","v":118},{"$f":"HLOOKUP(B8,October!$I$1:$BP$57,57,FALSE)","v":20},null,null,null,null,null,null,null,{"$f":"SUM(D8:M8)","v":299}]
[4,"Gary Fitzpatrick","Sun's Out Gunn's Out",{"$f":"HLOOKUP(B9,August!$I$1:$BP$87,87,FALSE)","v":113},{"$f":"HLOOKUP(B9,September!$I$1:$BP$81,81,FALSE)","v":165},{"$f":"HLOOKUP(B9,October!$I$1:$BP$57,57,FALSE)","v":20},null,null,null,null,null,null,null,{"$f":"SUM(D9:M9)","v":298}]
[5,"Con McSweeney","Dowtcha Boys",{"$f":"HLOOKUP(B10,August!$I$1:$BP$87,87,FALSE)","v":138},{"$f":"HLOOKUP(B10,September!$I$1:$BP$81,81,FALSE)","v":134},{"$f":"HLOOKUP(B10,October!$I$1:$BP$57,57,FALSE)","v":20},null,null,null,null,null,null,null,{"$f":"SUM(D10:M10)","v":292}]
[6,"Ralph Goodwin","Gorey Celtic Stars",{"$f":"HLOOKUP(B11,August!$I$1:$BP$87,87,FALSE)","v":164},{"$f":"HLOOKUP(B11,September!$I$1:$BP$81,81,FALSE)","v":96},{"$f":"HLOOKUP(B11,October!$I$1:$BP$57,57,FALSE)","v":30},null,null,null,null,null,null,null,{"$f":"SUM(D11:M11)","v":290}]
[7,"Gerard McCluskey","Breffni Blues 2019",{"$f":"HLOOKUP(B12,August!$I$1:$BP$87,87,FALSE)","v":113},{"$f":"HLOOKUP(B12,September!$I$1:$BP$81,81,FALSE)","v":133},{"$f":"HLOOKUP(B12,October!$I$1:$BP$57,57,FALSE)","v":40},null,null,null,null,null,null,null,{"$f":"SUM(D12:M12)","v":286}]
[8,"Wayne Donovan","Deprive The Five",{"$f":"HLOOKUP(B13,August!$I$1:$BP$87,87,FALSE)","v":154},{"$f":"HLOOKUP(B13,September!$I$1:$BP$81,81,FALSE)","v":96},{"$f":"HLOOKUP(B13,October!$I$1:$BP$57,57,FALSE)","v":35},null,null,null,null,null,null,null,{"$f":"SUM(D13:M13)","v":285}]
[9,"John Brophy","Carrig Combo",{"$f":"HLOOKUP(B14,August!$I$1:$BP$87,87,FALSE)","v":131},{"$f":"HLOOKUP(B14,September!$I$1:$BP$81,81,FALSE)","v":113},{"$f":"HLOOKUP(B14,October!$I$1:$BP$57,57,FALSE)","v":40},null,null,null,null,null,null,null,{"$f":"SUM(D14:M14)","v":284}]
[10,"Brendan Maguire","Cantthinkofone",{"$f":"HLOOKUP(B15,August!$I$1:$BP$87,87,FALSE)","v":141},{"$f":"HLOOKUP(B15,September!$I$1:$BP$81,81,FALSE)","v":124},{"$f":"HLOOKUP(B15,October!$I$1:$BP$57,57,FALSE)","v":15},null,null,null,null,null,null,null,{"$f":"SUM(D15:M15)","v":280}]
{"$rows_left_out":51}
{"sheet":"August","index":1,"n_rows":89,"n_cols":68,"rows_kept":89,"cut":false,"hidden":false,"merged":[[1,2,1,5]]}
[null,null,null,null,null,null,null,null,"Aidan Scanlon","Aidan White","Aiden Desch","Anastas Popov","Andy Dunne","Anthony Michaels","Barry McGoldrick","Bobby Hynes","Brendan Maguire","Brian Haughton","Brian Mullen","Brian Prendergast","Callum Dunne","Caroline Carroll","Chris Keohan","Ciaran O'Hart","Con McSweeney","Craig Calvert","Damien Martin","Darragh Kenny","Dave McGinley","David Cooney","Declan O'Neill","Eamon Fox","Eoghan Farrelly","Frank McSweeney","Gary Donnelly","Gary Fitzpatrick","Gary McGurk","Gavin Morgan","Gerard McCluskey","Gerry Draper","Gerry Moore","Graham Goodwin","Javier Suarez","Joe Behan","Joe Turner","John Brophy","Jonathan Fox","Karl Boland","Kevin Philpott","Kris Stainton","Liam Geraghty","Liam Keohan","Mai-Ly Turner","Matthew Lynch","Micheal Joyce","Niall Carroll","Paul Moore","Paul Prendergast","Phil Doyle","Philip Jordan","Ralph Goodwin","Richard Johnston","Roisin Joyce","Sean O'Mairtin","Simon Scanlon","Trevor Byrne","Victoria Reid","Wayne Donovan"]
["Day","Date","Teams",null,null,null,"Time"]
["Fri","2019-08-09","Liverpool",4,1,"Norwich City","20:00:00",null,5,5,5,5,5,5,5,5,5,5,5,5,5,5,5,5,5,5,5,5,5,5,5,5,5,5,5,5,5,5,5,5,5,5,5,10,5,5,5,5,5,5,5,5,5,5,5,5,5,5,5,5,5,5,5,5,5,5,5,5]
["Sat","2019-08-10","West Ham",0,5,"Man City","12:30:00",null,5,5,5,5,5,5,5,5,5,5,5,5,5,5,5,0,5,5,5,5,5,5,5,5,5,5,5,5,5,5,5,5,5,5,5,5,5,5,5,5,5,5,5,5,5,5,0,5,5,5,5,5,5,5,5,5,5,5,5,5]
["Sat","2019-08-10","Bournemouth",1,1,"Sheffield United","15:00:00",null,0,0,0,10,0,10,5,0,10,0,10,10,0,0,0,0,10,0,0,5,0,0,0,10,0,10,5,0,0,0,10,0,0,0,0,10,0,0,0,0,0,0,0,0,0,10,0,0,10,0,0,10,0,0,0,0,10,0,0,0]
["Sat","2019-08-10","Burnley",3,0,"Southampton","15:00:00",null,0,0,0,5,5,5,0,0,5,0,5,5,0,0,0,5,5,5,0,0,0,0,0,0,0,0,5,0,0,5,5,5,0,0,0,0,5,5,5,0,0,5,0,0,0,0,0,0,0,5,0,0,5,0,5,5,5,0,5,5]
["Sat","2019-08-10","Crystal Palace",0,0,"Everton","15:00:00",null,0,0,0,5,0,0,0,5,5,5,0,0,0,0,0,0,5,0,0,0,5,0,5,0,0,0,0,5,10,5,5,0,5,0,0,0,5,5,0,0,0,0,0,0,5,0,0,0,0,5,0,0,5,0,0,0,0,0,5,5]
["Sat","2019-08-10","Watford",0,3,"Brighton","15:00:00",null,0,5,0,0,0,0,0,0,0,0,0,0,0,0,0,0,0,0,0,0,0,0,0,0,0,0,0,0,0,0,0,0,0,0,0,0,0,0,0,0,0,0,0,0,0,0,0,0,0,0,0,0,0,0,0,0,0,0,0,0]
["Sat","2019-08-10","Tottenham",3,1,"Aston Villa","17:30:00",null,5,0,5,5,5,10,5,5,10,5,5,5,10,5,10,5,5,10,10,10,5,10,5,5,5,10,5,5,5,5,5,5,10,5,10,5,5,5,5,5,5,5,5,5,5,10,10,5,5,5,5,5,5,5,5,10,5,5,5,5]
["Sun","2019-08-11","Leicester City",0,0,"Wolves","14:00:00",null,0,5,5,5,0,0,0,0,0,0,0,5,0,0,0,5,5,5,5,0,5,0,5,0,0,0,5,5,0,0,0,0,0,0,0,5,5,0,0,0,5,5,5,0,5,5,0,5,0,5,0,5,0,0,0,5,5,0,0,5]
["Sun","2019-08-11","Newcastle United",0,1,"Arsenal","14:00:00",null,0,5,5,5,5,0,10,5,5,0,5,5,10,5,5,0,5,5,5,5,5,0,5,5,5,5,5,5,0,10,5,5,0,5,5,5,5,5,10,5,5,5,5,5,5,5,5,5,5,5,5,5,5,5,5,5,5,5,5,5]
["Sun","2019-08-11","Man United",4,0,"Chelsea","16:30:00",null,0,0,0,0,0,0,0,5,5,5,0,0,0,0,0,0,0,5,5,0,5,0,0,0,0,0,5,0,0,5,0,0,5,0,5,5,0,0,0,5,5,5,0,5,0,0,0,5,0,0,5,5,5,5,0,5,5,0,5,0]
["Sat","2019-08-17","Arsenal",2,1,"Burnley","12:30:00",null,10,5,0,5,5,5,5,5,5,5,5,5,5,5,5,5,5,5,5,5,5,10,5,5,5,10,5,5,5,5,10,10,10,5,5,5,5,5,5,5,5,10,10,5,10,5,10,5,0,5,5,5,5,5,5,10,5,5,5,10]
["Sat","2019-08-17","Aston Villa",1,2,"Bournemouth","15:00:00",null,0,0,0,0,0,0,5,0,0,0,0,0,0,0,0,0,0,0,0,0,0,0,0,0,0,0,0,0,0,0,5,0,0,0,5,0,0,0,0,0,0,0,0,0,0,0,0,0,0,0,0,0,0,0,0,0,0,10,0,0]
["Sat","2019-08-17","Brighton",1,1,"West Ham","15:00:00",null,0,0,10,10,0,0,0,10,10,0,0,10,0,0,0,10,0,0,0,0,0,10,10,10,0,10,0,0,10,0,0,0,0,0,5,5,0,0,0,0,0,0,0,0,0,0,10,0,0,0,10,10,0,0,10,5,10,0,0,10]
{"$rows_left_out":75}
{"sheet":"September","index":2,"n_rows":83,"n_cols":68,"rows_kept":83,"cut":false,"hidden":false,"merged":[[1,2,1,5]]}
[null,null,null,null,null,null,null,null,"Aidan Scanlon","Aidan White","Aiden Desch","Anastas Popov","Andy Dunne","Anthony Michaels","Barry McGoldrick","Bobby Hynes","Brendan Maguire","Brian Haughton","Brian Mullen","Brian Prendergast","Callum Dunne","Caroline Carroll","Chris Keohan","Ciaran O'Hart","Con McSweeney","Craig Calvert","Damien Martin","Darragh Kenny","Dave McGinley","David Cooney","Declan O'Neill","Eamon Fox","Eoghan Farrelly","Frank McSweeney","Gary Donnelly","Gary Fitzpatrick","Gary McGurk","Gavin Morgan","Gerard McCluskey","Gerry Draper","Gerry Moore","Graham Goodwin","Javier Suarez","Joe Behan","Joe Turner","John Brophy","Jonathan Fox","Karl Boland","Kevin Philpott","Kris Stainton","Liam Geraghty","Liam Keohan","Mai-Ly Turner","Matthew Lynch","Micheal Joyce","Niall Carroll","Paul Moore","Paul Prendergast","Phil Doyle","Philip Jordan","Ralph Goodwin","Richard Johnston","Roisin Joyce","Sean O'Mairtin","Simon Scanlon","Trevor Byrne","Victoria Reid","Wayne Donovan"]
["Day","Date","Teams",null,null,null,"Time"]
["Sun","2019-09-01","Everton",3,2,"Wolves","14:00:00",null,5,0,5,5,5,0,5,0,5,5,5,5,0,5,5,5,5,0,0,0,5,0,0,5,5,0,5,0,0,5,5,5,5,5,0,0,0,5,5,5,5,0,5,5,5,0,0,0,5,0,0,0,0,5,0,0,5,5,0,0]
["Sun","2019-09-01","Arsenal",2,2,"Tottenham","16:30:00",null,0,10,0,0,10,10,0,0,0,0,0,0,0,0,0,5,10,5,10,5,10,0,0,0,10,0,0,10,10,0,0,10,0,5,5,0,0,5,0,10,5,0,10,0,0,10,0,10,10,0,0,0,0,0,0,0,0,0,0,5]
["Sat","2019-09-14","Liverpool",3,1,"Newcastle United","12:30:00",null,10,5,5,5,5,5,5,5,5,5,5,5,5,5,5,5,5,5,10,5,5,5,5,5,5,5,5,5,5,5,10,5,5,5,5,5,5,5,5,5,5,5,5,5,10,5,5,5,5,5,5,5,5,5,5,5,5,5,5,5]
["Sat","2019-09-14","Brighton",1,1,"Burnley","15:00:00",null,10,10,0,10,0,0,10,0,10,0,0,10,0,0,0,10,10,10,0,0,10,10,10,10,0,10,5,10,5,0,0,10,5,10,5,10,0,0,0,0,10,0,0,0,0,10,10,10,0,0,5,0,10,0,0,10,0,10,0,10]
["Sat","2019-09-14","Man United",1,0,"Leicester City","15:00:00",null,5,5,5,5,0,10,0,0,5,5,0,5,0,0,5,0,0,5,5,0,5,0,0,0,5,5,5,0,5,0,5,0,0,5,0,0,0,5,0,5,5,5,5,0,0,0,0,5,0,0,0,5,0,0,5,5,5,5,5,0]
["Sat","2019-09-14","Sheffield United",0,1,"Southampton","15:00:00",null,0,0,0,0,0,0,0,0,0,0,0,0,0,0,0,5,0,0,5,0,0,0,0,0,0,0,0,0,0,0,0,0,0,0,0,0,0,0,0,0,5,0,0,10,0,0,0,0,0,0,0,0,0,0,0,0,0,0,0,0]
["Sat","2019-09-14","Tottenham",4,0,"Crystal Palace","15:00:00",null,5,5,5,5,5,5,5,5,5,5,5,5,5,5,5,5,5,5,5,5,5,5,5,5,5,5,5,5,5,5,5,5,5,5,5,5,5,5,5,5,5,5,5,5,5,5,5,5,5,5,5,5,5,5,5,5,5,5,5,5]
["Sat","2019-09-14","Wolves",2,5,"Chelsea","15:00:00",null,0,0,0,0,5,0,0,0,0,5,5,0,0,0,5,5,0,0,5,0,0,5,0,0,0,0,0,0,0,0,5,0,0,0,5,5,0,0,0,0,0,0,5,5,0,0,0,5,5,5,0,0,5,5,5,0,0,5,0,0]
["Sat","2019-09-14","Norwich City",3,2,"Man City","17:30:00",null,0,0,5,0,0,5,0,0,0,0,0,0,0,0,0,0,0,0,0,0,0,0,0,0,0,0,0,0,0,0,0,0,0,0,0,5,0,5,0,0,0,0,0,0,0,0,0,0,0,0,0,0,0,0,0,0,5,0,0,0]
["Sun","2019-09-15","Bournemouth",3,1,"Everton","14:00:00",null,0,0,5,5,5,5,5,5,5,0,0,0,0,0,5,0,5,5,0,0,0,5,5,0,0,0,0,10,0,0,0,0,0,5,0,0,0,5,0,5,0,0,0,0,0,0,0,5,0,0,0,0,5,0,0,0,5,5,0,0]
["Sun","2019-09-15","Watford",2,2,"Arsenal","16:30:00",null,0,0,0,5,5,0,0,0,0,0,0,0,0,0,0,0,0,0,0,0,0,0,0,0,0,0,0,10,5,0,10,0,0,0,0,0,10,0,0,0,0,0,0,0,0,0,0,0,0,0,0,0,0,0,0,0,0,0,0,5]
["Mon","2019-09-16","Aston Villa",0,0,"West Ham","20:00:00",null,0,0,0,5,0,0,10,5,0,5,0,0,0,0,0,5,0,5,5,0,0,5,5,0,0,0,5,0,0,5,0,0,5,0,5,0,0,0,0,0,0,5,0,0,0,0,5,5,5,0,5,0,0,5,0,5,0,0,0,0]
["Fri","2019-09-20","Southampton",1,3,"Bournemouth","20:00:00",null,0,0,0,0,0,0,0,0,0,0,0,0,5,5,5,0,0,0,0,0,0,0,0,0,0,0,0,0,0,0,0,0,0,0,0,0,0,5,0,0,0,0,0,5,0,0,5,0,0,0,0,0,0,0,0,0,0,0,0,0]
{"$rows_left_out":69}
{"sheet":"October","index":3,"n_rows":59,"n_cols":68,"rows_kept":59,"cut":false,"hidden":false,"merged":[[1,2,1,5]]}
[null,null,null,null,null,null,null,null,"Aidan Scanlon","Aidan White","Aiden Desch","Anastas Popov","Andy Dunne","Anthony Michaels","Barry McGoldrick","Bobby Hynes","Brendan Maguire","Brian Haughton","Brian Mullen","Brian Prendergast","Callum Dunne","Caroline Carroll","Chris Keohan","Ciaran O'Hart","Con McSweeney","Craig Calvert","Damien Martin","Darragh Kenny","Dave McGinley","David Cooney","Declan O'Neill","Eamon Fox","Eoghan Farrelly","Frank McSweeney","Gary Donnelly","Gary Fitzpatrick","Gary McGurk","Gavin Morgan","Gerard McCluskey","Gerry Draper","Gerry Moore","Graham Goodwin","Javier Suarez","Joe Behan","Joe Turner","John Brophy","Jonathan Fox","Karl Boland","Kevin Philpott","Kris Stainton","Liam Geraghty","Liam Keohan","Mai-Ly Turner","Matthew Lynch","Micheal Joyce","Niall Carroll","Paul Moore","Paul Prendergast","Phil Doyle","Philip Jordan","Ralph Goodwin","Richard Johnston","Roisin Joyce","Sean O'Mairtin","Simon Scanlon","Trevor Byrne","Victoria Reid","Wayne Donovan"]
["Day","Date","Teams",null,null,null,"Time"]
["Sat","2019-10-05","Brighton",3,0,"Tottenham","12:30:00",null,0,0,0,0,0,0,0,0,0,0,0,0,0,0,0,0,0,0,5,0,0,0,0,0,0,0,0,0,0,0,5,0,0,0,0,0,0,0,0,0,0,0,0,0,0,0,0,0,0,0,0,0,0,5,0,0,0,0,0,0]
["Sat","2019-10-05","Burnley",1,0,"Everton","15:00:00",null,0,0,0,10,5,0,5,5,5,5,0,0,0,0,5,10,5,5,0,5,0,5,0,5,5,0,0,5,5,5,10,10,0,0,0,5,0,10,10,0,0,0,0,0,0,0,0,0,5,5,5,10,5,0,5,5,0,0,0,10]
["Sat","2019-10-05","Liverpool",2,1,"Leicester City","15:00:00",null,0,10,5,5,5,5,5,10,5,5,0,10,5,5,5,0,5,0,5,5,5,5,5,10,5,5,5,10,5,10,5,10,0,5,10,5,10,0,10,5,10,0,5,0,5,5,0,0,5,5,0,5,10,5,5,5,0,5,5,10]
["Sat","2019-10-05","Norwich City",1,5,"Aston Villa","15:00:00",null,5,0,5,0,0,5,0,0,0,0,0,0,0,0,0,0,0,0,5,0,0,0,0,0,5,0,5,0,0,0,0,0,0,0,0,0,0,0,0,0,0,0,0,5,0,0,5,5,0,5,0,5,0,0,0,0,0,0,0,0]
["Sat","2019-10-05","Watford",0,0,"Sheffield United","15:00:00",null,0,5,0,0,5,10,5,0,0,5,0,0,5,5,0,0,0,5,0,0,5,0,0,0,0,0,0,0,0,0,0,0,5,10,10,0,5,10,0,0,0,0,0,0,5,5,0,0,5,0,0,5,0,0,0,5,0,5,0,5]
["Sat","2019-10-05","West Ham",1,2,"Crystal Palace","17:30:00",null,0,0,0,0,0,5,0,0,0,0,0,0,0,0,0,0,0,0,0,0,0,0,0,0,0,0,0,0,0,0,0,0,0,0,10,0,0,0,0,0,0,0,5,0,0,0,0,0,0,0,0,0,0,0,0,0,0,0,0,0]
["Sun","2019-10-06","Arsenal",1,0,"Bournemouth","14:00:00",null,5,5,5,5,5,5,5,5,5,5,5,5,5,5,5,5,5,5,5,5,5,5,5,5,5,5,5,5,5,5,10,5,5,5,5,5,5,5,5,5,5,5,5,5,5,5,5,5,5,5,5,10,10,5,5,5,5,5,5,5]
["Sun","2019-10-06","Man City",0,2,"Wolves","14:00:00",null,0,0,0,0,0,0,0,0,0,0,0,0,0,0,0,0,0,0,0,0,0,0,0,0,0,0,0,0,0,0,0,0,0,0,0,0,0,0,0,0,0,0,0,0,0,0,0,0,0,0,0,0,0,0,0,0,0,0,0,0]
["Sun","2019-10-06","Southampton",1,4,"Chelsea","14:00:00",null,5,5,0,5,0,5,5,5,0,5,5,5,5,5,5,0,5,5,5,0,5,5,0,5,5,5,5,0,0,5,0,5,5,5,10,0,5,5,5,5,5,5,5,5,5,5,5,5,5,5,5,5,5,10,5,0,5,5,0,5]
["Sun","2019-10-06","Newcastle United",1,0,"Man United","16:30:00",null,0,0,10,0,10,5,0,0,0,0,0,0,10,0,0,0,0,0,0,0,0,0,0,0,0,0,0,0,0,0,10,0,0,0,0,0,0,10,0,0,0,0,0,0,0,0,0,0,0,0,0,0,0,5,0,0,0,0,5,0]
["Sat","2019-10-19","Everton",null,null,"West Ham","12:30:00"]
["Sat","2019-10-19","Aston Villa",null,null,"Brighton","15:00:00"]
["Sat","2019-10-19","Bournemouth",null,null,"Norwich City","15:00:00"]
{"$rows_left_out":45}
{"sheet":"Ten Point Table","index":4,"n_rows":65,"n_cols":14,"rows_kept":65,"cut":false,"hidden":false,"merged":[]}
[]
[]
[]
[]
["No.","Name","Team Name","2019-08-01","2019-09-01","2019-10-01","2019-11-01","2019-12-01","2020-01-01","2020-02-01","2020-03-01","2020-04-01","2020-05-01","Total"]
[1,"Eamon Fox","It's Never Over, Never Really Over",{"$f":"HLOOKUP(B6,August!$I$1:$BP$89,89,FALSE)","v":9},{"$f":"HLOOKUP(B6,September!$I$1:$BP$83,83,FALSE)","v":5},null,null,null,null,null,null,null,null,{"$f":"SUM(D6:M6)","v":14}]
[2,"Sean O'Mairtin","Creweless",{"$f":"HLOOKUP(B7,August!$I$1:$BP$89,89,FALSE)","v":7},{"$f":"HLOOKUP(B7,September!$I$1:$BP$83,83,FALSE)","v":5},null,null,null,null,null,null,null,null,{"$f":"SUM(D7:M7)","v":12}]
[3,"Brendan Maguire","Cantthinkofone",{"$f":"HLOOKUP(B8,August!$I$1:$BP$89,89,FALSE)","v":5},{"$f":"HLOOKUP(B8,September!$I$1:$BP$83,83,FALSE)","v":6},null,null,null,null,null,null,null,null,{"$f":"SUM(D8:M8)","v":11}]
[4,"Callum Dunne","Seattle Sound Lads",{"$f":"HLOOKUP(B9,August!$I$1:$BP$89,89,FALSE)","v":6},{"$f":"HLOOKUP(B9,September!$I$1:$BP$83,83,FALSE)","v":5},null,null,null,null,null,null,null,null,{"$f":"SUM(D9:M9)","v":11}]
[5,"Ciaran O'Hart","Riverchapel Plate",{"$f":"HLOOKUP(B10,August!$I$1:$BP$89,89,FALSE)","v":5},{"$f":"HLOOKUP(B10,September!$I$1:$BP$83,83,FALSE)","v":6},null,null,null,null,null,null,null,null,{"$f":"SUM(D10:M10)","v":11}]
[6,"Gerard McCluskey","Breffni Blues 2019",{"$f":"HLOOKUP(B11,August!$I$1:$BP$89,89,FALSE)","v":4},{"$f":"HLOOKUP(B11,September!$I$1:$BP$83,83,FALSE)","v":7},null,null,null,null,null,null,null,null,{"$f":"SUM(D11:M11)","v":11}]
[7,"Anastas Popov","Super Saints",{"$f":"HLOOKUP(B12,August!$I$1:$BP$89,89,FALSE)","v":6},{"$f":"HLOOKUP(B12,September!$I$1:$BP$83,83,FALSE)","v":4},null,null,null,null,null,null,null,null,{"$f":"SUM(D12:M12)","v":10}]
[8,"Chris Keohan","Moves Like Agger",{"$f":"HLOOKUP(B13,August!$I$1:$BP$89,89,FALSE)","v":8},{"$f":"HLOOKUP(B13,September!$I$1:$BP$83,83,FALSE)","v":2},null,null,null,null,null,null,null,null,{"$f":"SUM(D13:M13)","v":10}]
[9,"Craig Calvert","United Manchester FC",{"$f":"HLOOKUP(B14,August!$I$1:$BP$89,89,FALSE)","v":6},{"$f":"HLOOKUP(B14,September!$I$1:$BP$83,83,FALSE)","v":4},null,null,null,null,null,null,null,null,{"$f":"SUM(D14:M14)","v":10}]
[10,"David Cooney","Lifeafterhazard",{"$f":"HLOOKUP(B15,August!$I$1:$BP$89,89,FALSE)","v":6},{"$f":"HLOOKUP(B15,September!$I$1:$BP$83,83,FALSE)","v":4},null,null,null,null,null,null,null,null,{"$f":"SUM(D15:M15)","v":10}]
{"$rows_left_out":51}
{"sheet":"Mini Leagues","index":5,"n_rows":66,"n_cols":4,"rows_kept":66,"cut":false,"hidden":false,"merged":[[4,0,4,3],[13,0,13,3],[24,0,24,3],[43,0,43,3],[50,0,50,3]]}
[]
[]
[]
[]
["The Behan Counters"]
["Pos.","Name","Team Name","Points"]
[1,"Roisin Joyce","LCR FC",{"$f":"VLOOKUP(B7,Leaderboard!$B$6:$N$66,13,FALSE)","v":279}]
[2,"Declan O'Neill","Athletico Spurs",{"$f":"VLOOKUP(B8,Leaderboard!$B$6:$N$66,13,FALSE)","v":273}]
[3,"Dave McGinley","Reservoir Dubs",{"$f":"VLOOKUP(B9,Leaderboard!$B$6:$N$66,13,FALSE)","v":256}]
[4,"Micheal Joyce","At Last 2019",{"$f":"VLOOKUP(B10,Leaderboard!$B$6:$N$66,13,FALSE)","v":254}]
[5,"Javier Suarez","Tika Taka",{"$f":"VLOOKUP(B11,Leaderboard!$B$6:$N$66,13,FALSE)","v":249}]
[6,"Joe Behan","Melchester Rovers",{"$f":"VLOOKUP(B12,Leaderboard!$B$6:$N$66,13,FALSE)","v":242}]
[]
["CIT Old Boys Network"]
["Pos.","Name","Team Name","Points"]
{"$rows_left_out":52}
{"sheet":"Jokers","index":6,"n_rows":61,"n_cols":35,"rows_kept":61,"cut":false,"hidden":false,"merged":[]}
["No.","Player","Team Name","Joker",1,2,3,4,5,6,7,8,9,10,11,12,13,14,15,16,17,18,19,20,21,22,23,24,25,26,27,28,29,30,"Total"]
[1,"Aidan Scanlon","Kilflynn Santos",null,null,null,null,null,null,null,null,null,null,null,null,null,null,null,null,null,null,null,null,null,null,null,null,null,null,null,null,null,null,null,{"$f":"COUNTIF(E2:AH2,\"a\")","v":0}]
[2,"Aidan White","Return of the Villans","1-0","a","a","a","a","a","a","a","a","a","a","a",null,null,null,null,null,null,null,null,null,null,null,null,null,null,null,null,null,null,null,11]
[3,"Aiden Desch","NumNuts","2-0","a","a","a","a","a","a","a","a","a","a","a","a","a","a","a","a","a","a","a","a","a","a","a","a","a","a","a","a","a","a",30]
[4,"Anastas Popov","Super Saints",null,null,null,null,null,null,null,null,null,null,null,null,null,null,null,null,null,null,null,null,null,null,null,null,null,null,null,null,null,null,null,0]
[5,"Andy Dunne","Matipswich Town",null,null,null,null,null,null,null,null,null,null,null,null,null,null,null,null,null,null,null,null,null,null,null,null,null,null,null,null,null,null,null,0]
[6,"Anthony Michaels","Offside Ref","1-0","a","a","a","a","a","a","a","a","a","a","a","a","a","a","a","a","a","a","a","a","a",null,null,null,null,null,null,null,null,null,21]
[7,"Barry McGoldrick","The Blarney Pilgrims","2-1","a","a","a","a","a","a","a","a","a","a",null,null,null,null,null,null,null,null,null,null,null,null,null,null,null,null,null,null,null,null,10]
[8,"Bobby Hynes","Born To Run",null,null,null,null,null,null,null,null,null,null,null,null,null,null,null,null,null,null,null,null,null,null,null,null,null,null,null,null,null,null,null,0]
[9,"Brendan Maguire","Cantthinkofone",null,null,null,null,null,null,null,null,null,null,null,null,null,null,null,null,null,null,null,null,null,null,null,null,null,null,null,null,null,null,null,0]
[10,"Brian Haughton","The Wexicans",null,null,null,null,null,null,null,null,null,null,null,null,null,null,null,null,null,null,null,null,null,null,null,null,null,null,null,null,null,null,null,0]
[11,"Brian Mullen","Where's Tony Galvin Now?",null,null,null,null,null,null,null,null,null,null,null,null,null,null,null,null,null,null,null,null,null,null,null,null,null,null,null,null,null,null,null,0]
[12,"Brian Prendergast","Magical Mustafi","2-1","a",null,null,null,null,null,null,null,null,null,null,null,null,null,null,null,null,null,null,null,null,null,null,null,null,null,null,null,null,null,1]
[13,"Callum Dunne","Seattle Sound Lads",null,null,null,null,null,null,null,null,null,null,null,null,null,null,null,null,null,null,null,null,null,null,null,null,null,null,null,null,null,null,null,0]
[14,"Caroline Carroll","Mane 10","2-0","a",null,null,null,null,null,null,null,null,null,null,null,null,null,null,null,null,null,null,null,null,null,null,null,null,null,null,null,null,null,{"$f":"COUNTIF(E15:AH15,\"a\")","v":1}]
{"$rows_left_out":46}